Reaction Details
TargetFatty acid synthase
LigandBDBM244743
Substrate/Competitorn/a
Meas. Tech.Biochemical Assay
Temperature277.15±n/a K
IC50 9±n/a nM
Commentsextracted
Citation Oslob, JDMcDowell, RSJohnson, RYang, HEvanchik, MZaharia, CACai, HHu, LWWagman, AS Heterocyclic modulators of lipid synthesis US Patent US9428502 Publication Date 8/30/2016
 
Fatty acid synthase
Name:Fatty acid synthase
Type:Enzyme
Mol. Mass.:273419.37
Organism:Homo sapiens (Human)
Description:P49327
Residue:2511
BDBM244743
NameBDBM244743
Synonyms:US10226449, cpd 353 | US9428502, 353
TypeSmall organic molecule
Emp. Form.C23H21ClN4O2
Mol. Mass.420.891
SMILESCc1ccc(cc1-c1[nH]c(CCO)nc1Cl)C(=O)N1CC(C1)c1ccc(cc1)C#N