Reaction Details
TargetHistone-lysine N-methyltransferase, H3 lysine-79 specific [1-416]
LigandBDBM244793
Substrate/Competitorn/a
Meas. Tech.In Vitro Biological Assay
IC50 2.51±n/a nM
Citation Klaus, CRaimondi, MADaigle, SRPollock, RM Combination therapy for treating cancer US Patent US9446064 Publication Date 9/20/2016
 
Histone-lysine N-methyltransferase, H3 lysine-79 specific [1-416]
Name:Histone-lysine N-methyltransferase, H3 lysine-79 specific [1-416]
Type:Protein
Mol. Mass.:47443.16
Organism:Homo sapiens (Human)
Description:Q8TEK3 aa 1-416
Residue:416
BDBM244793
NameBDBM244793
Synonyms:US9446064, A69
TypeSmall organic molecule
Emp. Form.C30H41N7O2
Mol. Mass.531.6922
SMILESCN(C[C@H]1C[C@H]([C@H](O)[C@@H]1O)n1ccc2c(N)ncnc12)[C@@H]1C[C@H](CCc2nc3cc(ccc3[nH]2)C(C)(C)C)C1