Reaction Details
TargetHistone-lysine N-methyltransferase, H3 lysine-79 specific [1-416]
LigandBDBM244795
Substrate/Competitorn/a
Meas. Tech.In Vitro Biological Assay
IC50 0.62±n/a nM
Citation Klaus, CRaimondi, MADaigle, SRPollock, RM Combination therapy for treating cancer US Patent US9446064 Publication Date 9/20/2016
 
Histone-lysine N-methyltransferase, H3 lysine-79 specific [1-416]
Name:Histone-lysine N-methyltransferase, H3 lysine-79 specific [1-416]
Type:Protein
Mol. Mass.:47443.16
Organism:Homo sapiens (Human)
Description:Q8TEK3 aa 1-416
Residue:416
BDBM244795
NameBDBM244795
Synonyms:US9446064, A86
TypeSmall organic molecule
Emp. Form.C29H39N7O3
Mol. Mass.533.6651
SMILESCN(C[C@H]1O[C@H]([C@H](O)[C@@H]1O)n1ccc2c(N)ncnc12)[C@@H]1C[C@H](CCc2nc3cc(ccc3[nH]2)C(C)(C)C)C1