Reaction Details
TargetCoagulation factor XI
LigandBDBM246196
Substrate/CompetitorBDBM246300
Meas. Tech.Inhibition Assay
pH7.4±n/a
Temperature298.15±n/a K
IC50 0.5±n/a nM
Commentsextracted
Citation Röhrig, SHillisch, AStraβburger, JHeitmeier, SSchmidt, MVSchlemmer, KTersteegen, ABuchmüller, AGerdes, CSchäfer, MKinzel, TTeller, HSchirok, HKlar, JNunez, EJ Substituted oxopyridine derivatives and use thereof in the treatment of cardiovascular disorders US Patent US9434690 Publication Date 9/6/2016
 
Coagulation factor XI
Name:Coagulation factor XI
Type:Enzyme
Mol. Mass.:70130.58
Organism:Homo sapiens (Human)
Description:P03951
Residue:625
BDBM246196
BDBM246300
NameBDBM246196
Synonyms:US10183932, Example 105 US9434690, 102 US9434690, 104 US9822102, Example 105
TypeSmall organic molecule
Emp. Form.C28H26ClN3O6
Mol. Mass.535.976
SMILESCOc1cn(C(CC2CCCCO2)C(=O)Nc2ccc(cc2)C(O)=O)c(=O)cc1-c1cc(Cl)ccc1C#N