Reaction Details
Target5-hydroxytryptamine receptor 2A
LigandBDBM246305
Substrate/Competitorn/a
Meas. Tech.[125I]DOI Radioligand Binding Assay.
pH7.4±n/a
Temperature298.15±n/a K
IC50 4.6±n/a nM
Commentsextracted
Citation Xiong, YCherrier, MCChoi, JSDosa, PISmith, BMStrah-Pleynet, SUllman, BTeegarden, B Pyrazole derivatives as modulators of the 5-HT2A serotonin receptor useful for the treatment of disorders related thereto US Patent US9434692 Publication Date 9/6/2016
 
5-hydroxytryptamine receptor 2A
Name:5-hydroxytryptamine receptor 2A
Type:undefined
Mol. Mass.:52607.65
Organism:Homo sapiens (Human)
Description:P28223
Residue:471
BDBM246305
NameBDBM246305
Synonyms:US9434692, 52
TypeSmall organic molecule
Emp. Form.C17H18BrFN4O2
Mol. Mass.409.253
SMILESCc1[nH]nc(C(=O)N2CCN(CC(=O)c3ccc(F)cc3)CC2)c1Br