Reaction Details
TargetDual specificity tyrosine-phosphorylation-regulated kinase 1A
LigandBDBM50434351
Substrate/Competitorn/a
Meas. Tech.HotSpot Technology Assay
pH7.5±n/a
Temperature298.15±n/a K
IC50 4.91±n/a nM
Commentsextracted
Citation Leblond, BCasagrande, ADesire, LFoucourt, ABesson, T DYRK1 inhibitors and uses thereof US Patent US9446044 Publication Date 9/20/2016
 
Dual specificity tyrosine-phosphorylation-regulated kinase 1A
Name:Dual specificity tyrosine-phosphorylation-regulated kinase 1A
Type:Enzyme
Mol. Mass.:85616.61
Organism:Homo sapiens (Human)
Description:Q13627
Residue:763
BDBM50434351
NameBDBM50434351
Synonyms:CHEMBL2386749 | US9446044, 60
TypeSmall organic molecule
Emp. Form.C17H12N6O4S
Mol. Mass.396.38
SMILESCOC(=N)c1nc2ccc3ncnc(Nc4ccc(O)c(c4)[N+]([O-])=O)c3c2s1