Reaction Details
TargetDual specificity tyrosine-phosphorylation-regulated kinase 1A
LigandBDBM50434353
Substrate/Competitorn/a
Meas. Tech.HotSpot Technology Assay
pH7.5±n/a
Temperature298.15±n/a K
IC50 0.22±n/a nM
Commentsextracted
Citation Leblond, BCasagrande, ADesire, LFoucourt, ABesson, T DYRK1 inhibitors and uses thereof US Patent US9446044 Publication Date 9/20/2016
 
Dual specificity tyrosine-phosphorylation-regulated kinase 1A
Name:Dual specificity tyrosine-phosphorylation-regulated kinase 1A
Type:Enzyme
Mol. Mass.:85616.61
Organism:Homo sapiens (Human)
Description:Q13627
Residue:763
BDBM50434353
NameBDBM50434353
Synonyms:CHEMBL2386747 | US9446044, 72
TypeSmall organic molecule
Emp. Form.C17H11Cl2N5OS
Mol. Mass.404.273
SMILESCOC(=N)c1nc2ccc3ncnc(Nc4ccc(Cl)cc4Cl)c3c2s1