Reaction Details
TargetDual specificity tyrosine-phosphorylation-regulated kinase 1B
LigandBDBM246372
Substrate/Competitorn/a
Meas. Tech.HotSpot Technology Assay
pH7.5±n/a
Temperature298.15±n/a K
IC50 3.66±n/a nM
Commentsextracted
Citation Leblond, BCasagrande, ADesire, LFoucourt, ABesson, T DYRK1 inhibitors and uses thereof US Patent US9446044 Publication Date 9/20/2016
 
Dual specificity tyrosine-phosphorylation-regulated kinase 1B
Name:Dual specificity tyrosine-phosphorylation-regulated kinase 1B
Type:Enzyme
Mol. Mass.:69222.24
Organism:Homo sapiens (Human)
Description:Q9Y463
Residue:629
BDBM246372
NameBDBM246372
Synonyms:US9446044, 47
TypeSmall organic molecule
Emp. Form.C18H12BrN5O3S
Mol. Mass.458.289
SMILESCOC(=N)c1nc2ccc3ncnc(Nc4cc5OCOc5c(Br)c4)c3c2s1