Reaction Details
TargetPancreatic triacylglycerol lipase
LigandBDBM246486
Substrate/CompetitorBDBM246504
Meas. Tech.In Vitro Pancreatic Lipase Assay
pH7.4±0
Temperature310.15±0 K
Ki 1.82e+3± 4.3e+2 nM
IC50 8.77e+3± 2.03e+3 nM
Citation Yang, MHChin, YWYoon, KDKim, J Phenolic compounds with pancreatic lipase inhibitory activity from Korean yam (Dioscorea opposita). J Enzyme Inhib Med Chem29:1-6 (2014) 
 
Pancreatic triacylglycerol lipase
Name:Pancreatic triacylglycerol lipase
Type:Enzyme
Mol. Mass.:50080.69
Organism:Sus scrofa (Pig)
Description:P00591
Residue:450
BDBM246486
BDBM246504
NameBDBM246486
Synonyms:3,3',5-Trihydroxy-2'-methoxybibenzyl (3)
TypeSmall organic molecule
Emp. Form.C15H16O4
Mol. Mass.260.2851
SMILESCOc1c(O)cccc1CCc1cc(O)cc(O)c1