Reaction Details
TargetPancreatic triacylglycerol lipase
LigandBDBM246488
Substrate/CompetitorBDBM246504
Meas. Tech.In Vitro Pancreatic Lipase Assay
pH7.4±0
Temperature310.15±0 K
Ki 5.06e+3± 2.4e+2 nM
IC50 2.536e+4± 1.14e+3 nM
Citation Yang, MHChin, YWYoon, KDKim, J Phenolic compounds with pancreatic lipase inhibitory activity from Korean yam (Dioscorea opposita). J Enzyme Inhib Med Chem29:1-6 (2014) 
 
Pancreatic triacylglycerol lipase
Name:Pancreatic triacylglycerol lipase
Type:Enzyme
Mol. Mass.:50080.69
Organism:Sus scrofa (Pig)
Description:P00591
Residue:450
BDBM246488
BDBM246504
NameBDBM246488
Synonyms:2',4-Dihydroxy-3,5-dihydroxy-4-methoxybibenzyl (6)
TypeSmall organic molecule
Emp. Form.C15H16O3
Mol. Mass.244.2857
SMILESCOc1c(O)cc(CCc2ccccc2)cc1O