Reaction Details
TargetPancreatic triacylglycerol lipase
LigandBDBM246495
Substrate/CompetitorBDBM246504
Meas. Tech.In Vitro Pancreatic Lipase Assay
pH7.4±0
Temperature310.15±0 K
Ki 8.57e+3± 4.1e+2 nM
IC50 4.061e+4± 1.93e+3 nM
Citation Yang, MHChin, YWYoon, KDKim, J Phenolic compounds with pancreatic lipase inhibitory activity from Korean yam (Dioscorea opposita). J Enzyme Inhib Med Chem29:1-6 (2014) 
 
Pancreatic triacylglycerol lipase
Name:Pancreatic triacylglycerol lipase
Type:Enzyme
Mol. Mass.:50080.69
Organism:Sus scrofa (Pig)
Description:P00591
Residue:450
BDBM246495
BDBM246504
NameBDBM246495
Synonyms:Hircinol (13)
TypeSmall organic molecule
Emp. Form.C15H14O3
Mol. Mass.242.2699
SMILESCOc1cc(O)cc2CCc3cccc(O)c3-c12