Reaction Details
TargetCarbonic anhydrase 2
LigandBDBM246511
Substrate/Competitorn/a
Meas. Tech.In Vitro Inhibition Assay
IC50 1.6971e+5±n/a nM
Citation Celik, FArslan, MYavuz, EDemir, DGençer, N Synthesis and carbonic anhydrase inhibitory properties of novel 1,4-dihydropyrimidinone substituted diarylureas. J Enzyme Inhib Med Chem29:18-22 (2014) 
 
Carbonic anhydrase 2
Name:Carbonic anhydrase 2
Type:Enzyme
Mol. Mass.:29250.71
Organism:Homo sapiens (Human)
Description:P00918
Residue:260
BDBM246511
NameBDBM246511
Synonyms:1-(3-Methoxyphenyl)-3-(4-(1,3,7,7-tetramethyl-5-oxo-1,2,3,4,5,6,7,8-octahydroquina zolin-4-yl)phenyl)thiourea (4g)
TypeSmall organic molecule
Emp. Form.C26H30N4O3S
Mol. Mass.478.606
SMILESCOc1cccc(NC(=S)Nc2ccc(cc2)C2N(C)C(=O)N(C)C3=C2C(=O)CC(C)(C)C3)c1