Reaction Details
TargetReplicase polyprotein 1a
LigandBDBM246521
Substrate/CompetitorBDBM246526
Meas. Tech.SARS-CoV PLpro Inhibition Assay
pH8±0
Ki 1.84e+4± 1.7e+3 nM
IC50 3.84e+4± 2.4e+3 nM
Citation Kim, DWSeo, KHCurtis-Long, MJOh, KYOh, JWCho, JKLee, KHPark, KH Phenolic phytochemical displaying SARS-CoV papain-like protease inhibition from the seeds of Psoralea corylifolia. J Enzyme Inhib Med Chem29:59-63 (2014) 
 
Replicase polyprotein 1a
Name:Replicase polyprotein 1a
Type:Enzyme
Mol. Mass.:486353.36
Organism:Human SARS coronavirus (SARS-CoV)
Description:P0C6U8
Residue:4382
BDBM246521
BDBM246526
NameBDBM246521
Synonyms:Bavachinin (1)
TypeSmall organic molecule
Emp. Form.C21H22O4
Mol. Mass.338.397
SMILES[#6]-[#8]-c1cc2-[#8]-[#6](-[#6]-[#6](=O)-c2cc1-[#6]\[#6]=[#6](\[#6])-[#6])-c1ccc(-[#8])cc1