Reaction Details
TargetReplicase polyprotein 1a
LigandBDBM246522
Substrate/CompetitorBDBM246526
Meas. Tech.SARS-CoV PLpro Inhibition Assay
pH8±0
Ki 9.4e+3± 8e+2 nM
IC50 1.83e+4± 1.1e+3 nM
Citation Kim, DWSeo, KHCurtis-Long, MJOh, KYOh, JWCho, JKLee, KHPark, KH Phenolic phytochemical displaying SARS-CoV papain-like protease inhibition from the seeds of Psoralea corylifolia. J Enzyme Inhib Med Chem29:59-63 (2014) 
 
Replicase polyprotein 1a
Name:Replicase polyprotein 1a
Type:Enzyme
Mol. Mass.:486353.36
Organism:Human SARS coronavirus (SARS-CoV)
Description:P0C6U8
Residue:4382
BDBM246522
BDBM246526
NameBDBM246522
Synonyms:Neobavaisoflavone (2)
TypeSmall organic molecule
Emp. Form.C20H18O4
Mol. Mass.322.3545
SMILES[#6]\[#6](-[#6])=[#6]\[#6]-c1cc(ccc1-[#8])-c1coc2cc(-[#8])ccc2c1=O