Reaction Details
TargetReplicase polyprotein 1a
LigandBDBM246523
Substrate/CompetitorBDBM246526
Meas. Tech.SARS-CoV PLpro Inhibition Assay
pH8±0
Ki 4.6e+3± 1.0e+3 nM
IC50 1.01e+4± 1.2e+3 nM
Citation Kim, DWSeo, KHCurtis-Long, MJOh, KYOh, JWCho, JKLee, KHPark, KH Phenolic phytochemical displaying SARS-CoV papain-like protease inhibition from the seeds of Psoralea corylifolia. J Enzyme Inhib Med Chem29:59-63 (2014) 
 
Replicase polyprotein 1a
Name:Replicase polyprotein 1a
Type:Enzyme
Mol. Mass.:486353.36
Organism:Human SARS coronavirus (SARS-CoV)
Description:P0C6U8
Residue:4382
BDBM246523
BDBM246526
NameBDBM246523
Synonyms:4'-O-methylbavachalcone (4)
TypeSmall organic molecule
Emp. Form.C21H22O4
Mol. Mass.338.397
SMILES[#6]-[#8]-c1cc(-[#8])c(cc1-[#6]\[#6]=[#6](\[#6])-[#6])-[#6](=O)\[#6]=[#6]\c1ccc(-[#8])cc1