Reaction Details
TargetCarbonic anhydrase 1
LigandBDBM50329823
Substrate/Competitorn/a
Meas. Tech.Thermal Shift Assay (TSA)
pH7±n/a
Kd 7140±n/a nM
Commentsextracted
Citation Zubriene, ACapkauskaite, EGylyte, JKi?onaite, MTumkevicius, SMatulis, D Benzenesulfonamides with benzimidazole moieties as inhibitors of carbonic anhydrases I, II, VII, XII and XIII. J Enzyme Inhib Med Chem29:124-31 (2014) 
 
Carbonic anhydrase 1
Name:Carbonic anhydrase 1
Type:Enzyme
Mol. Mass.:28873.37
Organism:Homo sapiens (Human)
Description:P00915
Residue:261
BDBM50329823
NameBDBM50329823
Synonyms:2-Chloro-5-[(2-ethyl-1H-benzimidazol-1-yl)acetyl]benzenesulfonamide N-alkylated benzimidazole derivative, 4e
TypeSmall organic molecule
Emp. Form.C17H16ClN3O3S
Mol. Mass.377.845
SMILESCCc1nc2ccccc2n1CC(=O)c1ccc(Cl)c(c1)S(N)(=O)=O