Reaction Details
TargetCarbonic anhydrase 1
LigandBDBM246567
Substrate/Competitorn/a
Meas. Tech.Thermal Shift Assay (TSA)
pH7±n/a
Kd 5±n/a nM
Commentsextracted
Citation Zubriene, ACapkauskaite, EGylyte, JKi?onaite, MTumkevicius, SMatulis, D Benzenesulfonamides with benzimidazole moieties as inhibitors of carbonic anhydrases I, II, VII, XII and XIII. J Enzyme Inhib Med Chem29:124-31 (2014) 
 
Carbonic anhydrase 1
Name:Carbonic anhydrase 1
Type:Enzyme
Mol. Mass.:28873.37
Organism:Homo sapiens (Human)
Description:P00915
Residue:261
BDBM246567
NameBDBM246567
Synonyms:2-Chloro-4-[(2-isopropyl-1H-benzimidazol-1-yl)acetyl]benzenesulfonamide (2h)
TypeSmall organic molecule
Emp. Form.C18H18ClN3O3S
Mol. Mass.391.872
SMILESCC(C)c1nc2ccccc2n1CC(=O)c1ccc(c(Cl)c1)S(N)(=O)=O