Reaction Details
TargetCarbonic anhydrase 1
LigandBDBM246571
Substrate/Competitorn/a
Meas. Tech.Thermal Shift Assay (TSA)
pH7±n/a
Kd 125±n/a nM
Commentsextracted
Citation Zubriene, ACapkauskaite, EGylyte, JKi?onaite, MTumkevicius, SMatulis, D Benzenesulfonamides with benzimidazole moieties as inhibitors of carbonic anhydrases I, II, VII, XII and XIII. J Enzyme Inhib Med Chem29:124-31 (2014) 
 
Carbonic anhydrase 1
Name:Carbonic anhydrase 1
Type:Enzyme
Mol. Mass.:28873.37
Organism:Homo sapiens (Human)
Description:P00915
Residue:261
BDBM246571
NameBDBM246571
Synonyms:3-[(2-Isobutyl-1H-benzimidazol-1-yl)acetyl]benzenesulfonamide (3i)
TypeSmall organic molecule
Emp. Form.C19H21N3O3S
Mol. Mass.371.453
SMILESCC(C)Cc1nc2ccccc2n1CC(=O)c1cccc(c1)S(N)(=O)=O