Reaction Details
TargetCarbonic anhydrase 2
LigandBDBM50163863
Substrate/Competitorn/a
Meas. Tech.Thermal Shift Assay (TSA)
pH7±n/a
Kd 8.3±n/a nM
Commentsextracted
Citation Zubriene, ACapkauskaite, EGylyte, JKi?onaite, MTumkevicius, SMatulis, D Benzenesulfonamides with benzimidazole moieties as inhibitors of carbonic anhydrases I, II, VII, XII and XIII. J Enzyme Inhib Med Chem29:124-31 (2014) 
 
Carbonic anhydrase 2
Name:Carbonic anhydrase 2
Type:Enzyme
Mol. Mass.:29250.71
Organism:Homo sapiens (Human)
Description:P00918
Residue:260
BDBM50163863
NameBDBM50163863
Synonyms:4-(1H-benzimidazol-1-ylacetyl)-2-chlorobenzenesulfonamide (2a) carbonic anhydrase (CA) inhibitors, benzenesulphonamide ligand, 2
TypeSmall organic molecule
Emp. Form.C15H12ClN3O3S
Mol. Mass.349.792
SMILESNS(=O)(=O)c1ccc(cc1Cl)C(=O)Cn1cnc2ccccc12