Reaction Details
TargetCarbonic anhydrase 2
LigandBDBM246555
Substrate/Competitorn/a
Meas. Tech.Thermal Shift Assay (TSA)
pH7±n/a
Kd 2.86±n/a nM
Commentsextracted
Citation Zubriene, ACapkauskaite, EGylyte, JKi?onaite, MTumkevicius, SMatulis, D Benzenesulfonamides with benzimidazole moieties as inhibitors of carbonic anhydrases I, II, VII, XII and XIII. J Enzyme Inhib Med Chem29:124-31 (2014) 
 
Carbonic anhydrase 2
Name:Carbonic anhydrase 2
Type:Enzyme
Mol. Mass.:29250.71
Organism:Homo sapiens (Human)
Description:P00918
Residue:260
BDBM246555
NameBDBM246555
Synonyms:4-[(2-Benzyl-1H-benzimidazol-1-yl)acetyl]-2-chlorobenzenesulfonamide (2d)
TypeSmall organic molecule
Emp. Form.C22H18ClN3O3S
Mol. Mass.439.915
SMILESNS(=O)(=O)c1ccc(cc1Cl)C(=O)Cn1c(Cc2ccccc2)nc2ccccc12