Reaction Details
TargetCarbonic anhydrase 12
LigandBDBM50163862
Substrate/Competitorn/a
Meas. Tech.Thermal Shift Assay (TSA)
pH7±n/a
Kd 909±n/a nM
Commentsextracted
Citation Zubriene, ACapkauskaite, EGylyte, JKi?onaite, MTumkevicius, SMatulis, D Benzenesulfonamides with benzimidazole moieties as inhibitors of carbonic anhydrases I, II, VII, XII and XIII. J Enzyme Inhib Med Chem29:124-31 (2014) 
 
Carbonic anhydrase 12
Name:Carbonic anhydrase 12
Type:Enzyme
Mol. Mass.:39456.00
Organism:Homo sapiens (Human)
Description:Catalytic domain of human cloned isozyme was used in the assay
Residue:354
BDBM50163862
NameBDBM50163862
Synonyms:4-(1H-benzimidazol-1-ylacetyl)benzenesulfonamide (1a) carbonic anhydrase (CA) inhibitors, benzenesulphonamide ligand, 1
TypeSmall organic molecule
Emp. Form.C15H13N3O3S
Mol. Mass.315.347
SMILESNS(=O)(=O)c1ccc(cc1)C(=O)Cn1cnc2ccccc12