Reaction Details
TargetCarbonic anhydrase 12
LigandBDBM246568
Substrate/Competitorn/a
Meas. Tech.Thermal Shift Assay (TSA)
pH7±n/a
Kd 20000±n/a nM
Commentsextracted
Citation Zubriene, ACapkauskaite, EGylyte, JKi?onaite, MTumkevicius, SMatulis, D Benzenesulfonamides with benzimidazole moieties as inhibitors of carbonic anhydrases I, II, VII, XII and XIII. J Enzyme Inhib Med Chem29:124-31 (2014) 
 
Carbonic anhydrase 12
Name:Carbonic anhydrase 12
Type:Enzyme
Mol. Mass.:39456.00
Organism:Homo sapiens (Human)
Description:Catalytic domain of human cloned isozyme was used in the assay
Residue:354
BDBM246568
NameBDBM246568
Synonyms:3-[(2-Isopropyl-1H-benzimidazol-1-yl)acetyl]benzenesulfonamide (3h)
TypeSmall organic molecule
Emp. Form.C18H19N3O3S
Mol. Mass.357.427
SMILESCC(C)c1nc2ccccc2n1CC(=O)c1cccc(c1)S(N)(=O)=O