Reaction Details
TargetCarbonic anhydrase 13
LigandBDBM246556
Substrate/Competitorn/a
Meas. Tech.Thermal Shift Assay (TSA)
pH7±n/a
Kd 1110±n/a nM
Commentsextracted
Citation Zubriene, ACapkauskaite, EGylyte, JKi?onaite, MTumkevicius, SMatulis, D Benzenesulfonamides with benzimidazole moieties as inhibitors of carbonic anhydrases I, II, VII, XII and XIII. J Enzyme Inhib Med Chem29:124-31 (2014) 
 
Carbonic anhydrase 13
Name:Carbonic anhydrase 13
Type:Enzyme
Mol. Mass.:29445.78
Organism:Homo sapiens (Human)
Description:Q8N1Q1
Residue:262
BDBM246556
NameBDBM246556
Synonyms:3-[(2-Benzyl-1H-benzimidazol-1-yl)acetyl]benzenesulfonamide (3d)
TypeSmall organic molecule
Emp. Form.C22H19N3O3S
Mol. Mass.405.47
SMILESNS(=O)(=O)c1cccc(c1)C(=O)Cn1c(Cc2ccccc2)nc2ccccc12