Reaction Details
TargetIsocitrate dehydrogenase [NADP] cytoplasmic
LigandBDBM247860
Substrate/Competitorn/a
Meas. Tech.LC-MS Detection of 2-HG Assay
pH7.4±n/a
Temperature298.15±n/a K
IC50<2.29±n/a nM
Commentsextracted
Citation Caferro, TRChen, ZCho, YSCostales, AQLevell, JRLiu, GManning, JRSendzik, MShafer, CShultz, MDSutton, JWang, YZhao, Q 3-pyrimidin-4-yl-oxazolidin-2-ones as inhibitors of mutant IDH US Patent US9434719 Publication Date 9/6/2016
 
Isocitrate dehydrogenase [NADP] cytoplasmic
Name:Isocitrate dehydrogenase [NADP] cytoplasmic
Type:Protein
Mol. Mass.:46661.29
Organism:Homo sapiens (Human)
Description:O75874
Residue:414
BDBM247860
NameBDBM247860
Synonyms:US9434719, 467 | US9688672, Example 467
TypeSmall organic molecule
Emp. Form.C22H19F5N6O2
Mol. Mass.494.4173
SMILESC[C@H](F)C1COC(=O)N1c1ccnc(N[C@@H](C)c2ncc(cn2)-c2cccc(c2F)C(F)(F)F)n1