Reaction Details
TargetNeuronal acetylcholine receptor subunit alpha-7
LigandBDBM248004
Substrate/Competitorn/a
Meas. Tech.Radioligand Binding Assay
pH7.4±n/a
Temperature310.15±n/a K
Ki 12.2±n/a nM
IC50 14.1±n/a nM
Commentsextracted
Citation Bilcer, GMNg, R Quinuclidines for modulating alpha 7 activity US Patent US9434724 Publication Date 9/6/2016
 
Neuronal acetylcholine receptor subunit alpha-7
Name:Neuronal acetylcholine receptor subunit alpha-7
Type:Enzyme
Mol. Mass.:56502.44
Organism:Rattus norvegicus (Rat)
Description:Q05941
Residue:502
BDBM248004
NameBDBM248004
Synonyms:US9434724, 13
TypeSmall organic molecule
Emp. Form.C17H19FN2O2
Mol. Mass.302.3434
SMILESFc1cccc2[nH]cc(C(=O)OCC34CCN(CC3)CC4)c12