Reaction Details
TargetNeuronal acetylcholine receptor subunit alpha-7
LigandBDBM248022
Substrate/Competitorn/a
Meas. Tech.Radioligand Binding Assay
pH7.4±n/a
Temperature310.15±n/a K
Ki 43.2±n/a nM
IC50 49.6±n/a nM
Commentsextracted
Citation Bilcer, GMNg, R Quinuclidines for modulating alpha 7 activity US Patent US9434724 Publication Date 9/6/2016
 
Neuronal acetylcholine receptor subunit alpha-7
Name:Neuronal acetylcholine receptor subunit alpha-7
Type:Enzyme
Mol. Mass.:56502.44
Organism:Rattus norvegicus (Rat)
Description:Q05941
Residue:502
BDBM248022
NameBDBM248022
Synonyms:US9434724, 33
TypeSmall organic molecule
Emp. Form.C18H21FN2O3
Mol. Mass.332.3693
SMILESCOc1cc(F)c2c(c[nH]c2c1)C(=O)OCC12CCN(CC1)CC2