Reaction Details
TargetNeuronal acetylcholine receptor subunit alpha-7
LigandBDBM247967
Substrate/Competitorn/a
Meas. Tech.Radioligand Binding Assay
pH7.4±n/a
Temperature310.15±n/a K
Ki 28.5±n/a nM
IC50 33.3±n/a nM
Commentsextracted
Citation Bilcer, GMNg, R Quinuclidines for modulating alpha 7 activity US Patent US9434724 Publication Date 9/6/2016
 
Neuronal acetylcholine receptor subunit alpha-7
Name:Neuronal acetylcholine receptor subunit alpha-7
Type:Enzyme
Mol. Mass.:56502.44
Organism:Rattus norvegicus (Rat)
Description:Q05941
Residue:502
BDBM247967
NameBDBM247967
Synonyms:US9434724, 47
TypeSmall organic molecule
Emp. Form.C18H21BrN2O3
Mol. Mass.393.275
SMILESCOc1ccc2[nH]cc(C(=O)OCC34CCN(CC3)CC4)c2c1Br