Reaction Details
TargetVoltage-dependent N-type calcium channel subunit alpha-1B
LigandBDBM247254
Substrate/Competitorn/a
Meas. Tech.Patch Clamp/Inhibition Assay
Ki 100±n/a nM
Citation Pevarello, P Fluorinated arylalkylaminocarboxamide derivatives US Patent US9447029 Publication Date 9/20/2016
 
Voltage-dependent N-type calcium channel subunit alpha-1B
Name:Voltage-dependent N-type calcium channel subunit alpha-1B
Type:Enzyme
Mol. Mass.:262548.16
Organism:Homo sapiens (Human)
Description:Q00975
Residue:2339
BDBM247254
NameBDBM247254
Synonyms:US9447029, 1-7
TypeSmall organic molecule
Emp. Form.C16H21F5N2O2
Mol. Mass.368.3422
SMILESCN(C)C(=O)CNCC(F)(F)c1cccc(OCCCC(F)(F)F)c1