Reaction Details
TargetVoltage-dependent N-type calcium channel subunit alpha-1B
LigandBDBM247255
Substrate/Competitorn/a
Meas. Tech.Patch Clamp/Inhibition Assay
Ki 500±n/a nM
Citation Pevarello, P Fluorinated arylalkylaminocarboxamide derivatives US Patent US9447029 Publication Date 9/20/2016
 
Voltage-dependent N-type calcium channel subunit alpha-1B
Name:Voltage-dependent N-type calcium channel subunit alpha-1B
Type:Enzyme
Mol. Mass.:262548.16
Organism:Homo sapiens (Human)
Description:Q00975
Residue:2339
BDBM247255
NameBDBM247255
Synonyms:US9447029, 1-14
TypeSmall organic molecule
Emp. Form.C19H22F2N2O2
Mol. Mass.348.387
SMILESCN(C)C(=O)CNCC(F)(F)c1cccc(OCc2ccccc2)c1