Reaction Details
TargetPhospholipase D1
LigandBDBM247410
Substrate/Competitorn/a
Meas. Tech.Cell-Based Assay
IC50 3.7±n/a nM
Citation Lindsley, CWBrown, AH Antiviral therapies with phospholipase D inhibitors US Patent US9453017 Publication Date 9/27/2016
 
Phospholipase D1
Name:Phospholipase D1
Type:Protein
Mol. Mass.:124219.92
Organism:Homo sapiens (Human)
Description:Q13393
Residue:1074
BDBM247410
NameBDBM247410
Synonyms:US9453017, 2
TypeSmall organic molecule
Emp. Form.C25H29BrN4O2
Mol. Mass.497.427
SMILESC[C@@H](CN1CCC(CC1)n1c2ccc(Br)cc2[nH]c1=O)NC(=O)[C@@H]1C[C@@H]1c1ccccc1