Reaction Details
TargetCoagulation factor XI
LigandBDBM247413
Substrate/CompetitorUS9453018, pyroGlu-Pro-Arg-pNA
Meas. Tech.In Vitro Assay
pH7.4±n/a
Temperature310.15±n/a K
Ki 0.2±n/a nM
Citation Dilger, AKCorte, JRDe Lucca, IFang, TYang, WWang, YPabbisetty, KBEwing, WRZhu, YWexler, RRPinto, DJOrwat, MJSmith, II, LM Pyrimidinones as factor XIa inhibitors US Patent US9453018 Publication Date 9/27/2016
 
Coagulation factor XI
Name:Coagulation factor XI
Type:Enzyme
Mol. Mass.:70130.58
Organism:Homo sapiens (Human)
Description:P03951
Residue:625
BDBM247413
US9453018, pyroGlu-Pro-Arg-pNA
NameBDBM247413
Synonyms:US10336754, Example 363 US9453018, 362 | US9453018, 363
TypeSmall organic molecule
Emp. Form.C28H25Cl2N9O2
Mol. Mass.590.463
SMILESC[C@@H]1CCC[C@@H](c2ccnc(c2)-c2c(NC1=O)cnn2C)n1cnc(cc1=O)-c1cc(Cl)ccc1-n1cc(Cl)nn1