Reaction Details
TargetSphingomyelinase C
LigandBDBM248063
Substrate/Competitorn/a
Meas. Tech.Turbidometric Assay
pH7.5±0
Temperature310.15±0 K
Ki 1.3e+3±n/a nM
IC50 8e+2±n/a nM
Citation Oda, MImagawa, HKato, RYabiku, KYoshikawa, TTakemoto, TTakahashi, HYamamoto, HNishizawa, MSakurai, JNagahama, M Novel inhibitor of bacterial sphingomyelinase, SMY-540, developed based on three-dimensional structure analysis. J Enzyme Inhib Med Chem29:303-10 (2014) 
 
Sphingomyelinase C
Name:Sphingomyelinase C
Type:Enzyme
Mol. Mass.:36871.19
Organism:Bacillus cereus
Description:P11889
Residue:333
BDBM248063
NameBDBM248063
Synonyms:SMY-540
TypeSmall organic molecule
Emp. Form.C26H31N3O3
Mol. Mass.433.5426
SMILESCCCCCC(=O)N[C@@H](COCc1cccc(n1)-c1ccccn1)[C@H](O)c1ccccc1