Reaction Details
TargetCarbonic anhydrase 9
LigandBDBM248069
Substrate/Competitorn/a
Meas. Tech.CA Inhibition Assay
pH7.5±n/a
Temperature277.15±n/a K
Ki 2.3e+2±n/a nM
Commentsextracted
Citation Sharma, ATiwari, MSupuran, CT Novel coumarins and benzocoumarins acting as isoform-selective inhibitors against the tumor-associated carbonic anhydrase IX. J Enzyme Inhib Med Chem29:292-6 (2014) 
 
Carbonic anhydrase 9
Name:Carbonic anhydrase 9
Type:Enzyme
Mol. Mass.:49669.03
Organism:Homo sapiens (Human)
Description:Catalytic domain of human cloned isozyme was used in the assay
Residue:459
BDBM248069
NameBDBM248069
Synonyms:4-Methyl-2H-benzo[h]chromen-2-one (4)
TypeSmall organic molecule
Emp. Form.C14H10O2
Mol. Mass.210.228
SMILESCc1cc(=O)oc2c1ccc1ccccc21