Reaction Details
TargetCarbonic anhydrase 5B, mitochondrial
LigandBDBM10883
Substrate/Competitorn/a
Meas. Tech.CA Inhibition Assay
pH7.5±n/a
Temperature298.15±n/a K
Ki 21±n/a nM
Commentsextracted
Citation Durdagi, SScozzafava, GVullo, DSahin, HKolayli, SSupuran, CT Inhibition of mammalian carbonic anhydrases I-XIV with grayanotoxin III: solution and in silico studies. J Enzyme Inhib Med Chem29:469-75 (2014) 
 
Carbonic anhydrase 5B, mitochondrial
Name:Carbonic anhydrase 5B, mitochondrial
Type:Enzyme
Mol. Mass.:36440.83
Organism:Homo sapiens (Human)
Description:Human (cloned) isozyme
Residue:317
BDBM10883
NameBDBM10883
Synonyms:4,5-dichlorobenzene-1,3-disulfonamide Dichlorophenamide Dichlorophenamide, DCP US10172837, Dichlorphenamide | sulfonamide 4
TypeSmall organic molecule
Emp. Form.C6H6Cl2N2O4S2
Mol. Mass.305.159
SMILESNS(=O)(=O)c1cc(Cl)c(Cl)c(c1)S(N)(=O)=O