Reaction Details
TargetCarbonic anhydrase [110-330]
LigandBDBM36181
Substrate/Competitorn/a
Meas. Tech.Stopped Flow CO2 Hydration Assay
pH8.3±n/a
Temperature293.15±n/a K
Ki 64500±n/a nM
Citation Dathan, NAAlterio, VTroiano, EVullo, DLudwig, MDe Simone, GSupuran, CTMonti, SM Biochemical characterization of the chloroplastic ß-carbonic anhydrase from Flaveria bidentis (L.) "Kuntze". J Enzyme Inhib Med Chem29:500-4 (2014) 
 
Carbonic anhydrase [110-330]
Name:Carbonic anhydrase [110-330]
Type:Enzyme
Mol. Mass.:24226.97
Organism:Flaveria bidentis (Coastal plain yellowtops)
Description:Truncated version without chloroplast transit peptide (1-109)
Residue:221
BDBM36181
NameBDBM36181
Synonyms:SODIUM BENZOATE benzoic acid | benzoic acid-d5
TypeGuest
Emp. Form.C7H5O2
Mol. Mass.121.1139
SMILES[O-]C(=O)c1ccccc1