Reaction Details
TargetSecreted chorismate mutase
LigandBDBM50164168
Substrate/Competitorn/a
Meas. Tech.CM Assay
pH7.5±0
Temperature310.15±0 K
IC50 2.858e+4± 1.7e+3 nM
Citation Alokam, RJeankumar, VUSridevi, JPMatikonda, SSPeddi, SAlvala, MYogeeswari, PSriram, D Identification and structure-activity relationship study of carvacrol derivatives as Mycobacterium tuberculosis chorismate mutase inhibitors. J Enzyme Inhib Med Chem29:547-54 (2014) 
 
Secreted chorismate mutase
Name:Secreted chorismate mutase
Type:Protein
Mol. Mass.:21942.03
Organism:Mycobacterium tuberculosis H37Rv
Description:n/a
Residue:199
BDBM50164168
NameBDBM50164168
Synonyms:1,3,4-Eugenol 1-Hydroxy-2-methoxy-4-prop-2-enylbenzene 1-allyl-3-methoxy-4-hydroxybenzene 2-Hydroxy-5-allylanisole 2-Methoxy-4-allylphenol 2-methoxy-4-(prop-2-en-1-yl)phenol4-allyl-2-methoxyphenol 4-Allylcatechol-2-methyl ether 4-Hydroxy-3-methoxy-1-allylbenzene CHEMBL42710 Eugenic acid p-Allylguaiacol | p-Eugenol
TypeSmall organic molecule
Emp. Form.C10H12O2
Mol. Mass.164.2011
SMILESCOc1cc(CC=C)ccc1O