Reaction Details
TargetSerine/threonine-protein kinase pim-3
LigandBDBM248996
Substrate/Competitorn/a
Meas. Tech.Kinase Binding Assay
pH7.2±n/a
Temperature298.15±n/a K
Ki 0.019±n/a nM
Commentsextracted
Citation Do, SHu, HKolesnikov, ATsui, VHWang, X 5-azaindazole compounds and methods of use US Patent US9434725 Publication Date 9/6/2016
 
Serine/threonine-protein kinase pim-3
Name:Serine/threonine-protein kinase pim-3
Type:Protein
Mol. Mass.:35888.19
Organism:Homo sapiens (Human)
Description:Q86V86
Residue:326
BDBM248996
NameBDBM248996
Synonyms:US9434725, 227
TypeSmall organic molecule
Emp. Form.C22H22F2N8
Mol. Mass.436.4605
SMILESCc1cncc(n1)-c1cc2n(ncc2cn1)-c1ccc(C(F)F)c(n1)N1CCC[C@H](N)C1