Reaction Details
TargetSerine/threonine-protein kinase pim-3
LigandBDBM249028
Substrate/Competitorn/a
Meas. Tech.Kinase Binding Assay
pH7.2±n/a
Temperature298.15±n/a K
Ki 0.0235±n/a nM
Commentsextracted
Citation Do, SHu, HKolesnikov, ATsui, VHWang, X 5-azaindazole compounds and methods of use US Patent US9434725 Publication Date 9/6/2016
 
Serine/threonine-protein kinase pim-3
Name:Serine/threonine-protein kinase pim-3
Type:Protein
Mol. Mass.:35888.19
Organism:Homo sapiens (Human)
Description:Q86V86
Residue:326
BDBM249028
NameBDBM249028
Synonyms:US9434725, 259 US9434725, 272
TypeSmall organic molecule
Emp. Form.C21H19F2N7
Mol. Mass.407.4193
SMILESCc1cncc(n1)-c1cc2n(ncc2cn1)-c1cccc(n1)C1CNCCC1(F)F