Reaction Details
TargetSerine/threonine-protein kinase pim-3
LigandBDBM249086
Substrate/Competitorn/a
Meas. Tech.Kinase Binding Assay
pH7.2±n/a
Temperature298.15±n/a K
Ki 0.026±n/a nM
Commentsextracted
Citation Do, SHu, HKolesnikov, ATsui, VHWang, X 5-azaindazole compounds and methods of use US Patent US9434725 Publication Date 9/6/2016
 
Serine/threonine-protein kinase pim-3
Name:Serine/threonine-protein kinase pim-3
Type:Protein
Mol. Mass.:35888.19
Organism:Homo sapiens (Human)
Description:Q86V86
Residue:326
BDBM249086
NameBDBM249086
Synonyms:US9434725, 317
TypeSmall organic molecule
Emp. Form.C22H20N8
Mol. Mass.396.4478
SMILESCC#Cc1cncc(n1)-c1cc2n(ncc2cn1)-c1cccc(n1)N1CCNCC1