Reaction Details
TargetBeta-secretase 2
LigandBDBM249095
Substrate/Competitorn/a
Meas. Tech.Time-Resolved Endpoint Proteolysis Assay
pH5±n/a
Temperature303.15±n/a K
Ki 0.9±n/a nM
Commentsextracted
Citation Gilbert, EJCumming, JNScott, JDWu, WBurnett, DAStamford, AW C2-azaspiro iminothiazine dioxides as BACE inhibitors, compositions, and their use US Patent US9453034 Publication Date 9/27/2016
 
Beta-secretase 2
Name:Beta-secretase 2
Type:Protein
Mol. Mass.:56171.20
Organism:Homo sapiens (Human)
Description:Q9Y5Z0
Residue:518
BDBM249095
NameBDBM249095
Synonyms:US9453034, 9
TypeSmall organic molecule
Emp. Form.C22H26FN5O4S
Mol. Mass.475.536
SMILESCOc1cnc(C(=O)Nc2ccc(F)c(c2)[C@]2(C)CS(=O)(=O)C3(CN(C)C3)C(=N)N2)c(C)c1