Reaction Details
TargetBeta-secretase 2
LigandBDBM249099
Substrate/Competitorn/a
Meas. Tech.Time-Resolved Endpoint Proteolysis Assay
pH5±n/a
Temperature303.15±n/a K
Ki 0.8±n/a nM
Commentsextracted
Citation Gilbert, EJCumming, JNScott, JDWu, WBurnett, DAStamford, AW C2-azaspiro iminothiazine dioxides as BACE inhibitors, compositions, and their use US Patent US9453034 Publication Date 9/27/2016
 
Beta-secretase 2
Name:Beta-secretase 2
Type:Protein
Mol. Mass.:56171.20
Organism:Homo sapiens (Human)
Description:Q9Y5Z0
Residue:518
BDBM249099
NameBDBM249099
Synonyms:US9453034, 12a
TypeSmall organic molecule
Emp. Form.C24H25FN6O3S
Mol. Mass.496.557
SMILESCN1CC2(C1)C(=N)N[C@@](C)(CS2(=O)=O)c1cc(NC(=O)c2ncc(cc2C2CC2)C#N)ccc1F