Reaction Details
TargetBromodomain-containing protein 4 [368-440]
LigandBDBM249276
Substrate/Competitorn/a
Meas. Tech.Homogeneous Time Resolved Fluorescence Resonance Energy Transfer (TR-FRET) Assay
pH7.5±n/a
Temperature298.15±n/a K
IC50 69.2±n/a nM
Commentsextracted
Citation Aktoudianakis, EChin, GCorkey, BKDu, JElbel, KJiang, RHKobayashi, TLee, RMartinez, RMetobo, SEMish, MMunoz, MShevick, SSperandio, DYang, HZablocki, J Benzimidazole derivatives as bromodomain inhibitors US Patent US9458145 Publication Date 10/4/2016
 
Bromodomain-containing protein 4 [368-440]
Name:Bromodomain-containing protein 4 [368-440]
Type:Protein
Mol. Mass.:8564.63
Organism:Homo sapiens (Human)
Description:BD2 (368-440 aa) of O60885
Residue:73
BDBM249276
NameBDBM249276
Synonyms:US10017501, Compound 1020-12 | US9458145, 1020-12
TypeSmall organic molecule
Emp. Form.C20H21N5O
Mol. Mass.347.4136
SMILESCc1cnn(C)c1-c1cc(cc2nc([nH]c12)C1CC1)-c1c(C)noc1C