Reaction Details
TargetBromodomain-containing protein 4 [75-147]
LigandBDBM249279
Substrate/Competitorn/a
Meas. Tech.Amplified Luminescent Proximity Homogeneous Assay (ALPHA)
pH7.5±n/a
Temperature298.15±n/a K
IC50 18.1±n/a nM
Commentsextracted
Citation Aktoudianakis, EChin, GCorkey, BKDu, JElbel, KJiang, RHKobayashi, TLee, RMartinez, RMetobo, SEMish, MMunoz, MShevick, SSperandio, DYang, HZablocki, J Benzimidazole derivatives as bromodomain inhibitors US Patent US9458145 Publication Date 10/4/2016
 
Bromodomain-containing protein 4 [75-147]
Name:Bromodomain-containing protein 4 [75-147]
Type:n/a
Mol. Mass.:8856.55
Organism:Homo sapiens (Human)
Description:BD1 (75-147 aa) of O60885
Residue:73
BDBM249279
NameBDBM249279
Synonyms:US10017501, Compound 1020-28 | US9458145, 1020-28
TypeSmall organic molecule
Emp. Form.C21H25N3O
Mol. Mass.335.4427
SMILESCC\C=C(/CC)c1cc(cc2nc([nH]c12)C1CC1)-c1c(C)noc1C