Reaction Details
TargetBromodomain-containing protein 4 [75-147]
LigandBDBM249305
Substrate/Competitorn/a
Meas. Tech.Ligand KI Assay
pH7.5±n/a
Temperature298.15±n/a K
IC50 4.0±n/a nM
Commentsextracted
Citation Aktoudianakis, EChin, GCorkey, BKDu, JElbel, KJiang, RHKobayashi, TLee, RMartinez, RMetobo, SEMish, MMunoz, MShevick, SSperandio, DYang, HZablocki, J Benzimidazole derivatives as bromodomain inhibitors US Patent US9458145 Publication Date 10/4/2016
 
Bromodomain-containing protein 4 [75-147]
Name:Bromodomain-containing protein 4 [75-147]
Type:n/a
Mol. Mass.:8856.55
Organism:Homo sapiens (Human)
Description:BD1 (75-147 aa) of O60885
Residue:73
BDBM249305
NameBDBM249305
Synonyms:US10017501, Compound 1020-103 | US9458145, 1020-103
TypeSmall organic molecule
Emp. Form.C22H19N5O2S2
Mol. Mass.449.549
SMILESCc1noc(C)c1-c1cc(c2nc([nH]c2c1)C1CC1)C(O)(c1nccs1)c1nccs1