Reaction Details
TargetRetinol-binding protein 4
LigandBDBM249522
Substrate/Competitorn/a
Meas. Tech.Scintillation Proximity Binding Assay
pH7.4±n/a
Temperature277.15±n/a K
IC50 3.446949±n/a nM
Commentsextracted
Citation Petrukhin, KCioffi, CJohnson, GAllikmets, RFreeman, EChen, PConlon, MZhu, L Substituted 4-phenylpiperidines, their preparation and use US Patent US9434727 Publication Date 9/6/2016
 
Retinol-binding protein 4
Name:Retinol-binding protein 4
Type:Protein
Mol. Mass.:23008.75
Organism:Homo sapiens (Human)
Description:P02753
Residue:201
BDBM249522
NameBDBM249522
Synonyms:US10072016, Compound 120 US10913746, Compound 120 US9434727, 120 | US9777010, Compound 120
TypeSmall organic molecule
Emp. Form.C20H18F5N5O
Mol. Mass.439.3818
SMILESFc1ccc(C2CCN(CC2)C(=O)c2n[nH]c3CN(CCc23)C#N)c(c1F)C(F)(F)F