Reaction Details
TargetRetinol-binding protein 4
LigandBDBM249550
Substrate/Competitorn/a
Meas. Tech.Scintillation Proximity Binding Assay
pH7.4±n/a
Temperature277.15±n/a K
IC50<1.371742±n/a nM
Commentsextracted
Citation Petrukhin, KCioffi, CJohnson, GAllikmets, RFreeman, EChen, PConlon, MZhu, L Substituted 4-phenylpiperidines, their preparation and use US Patent US9434727 Publication Date 9/6/2016
 
Retinol-binding protein 4
Name:Retinol-binding protein 4
Type:Protein
Mol. Mass.:23008.75
Organism:Homo sapiens (Human)
Description:P02753
Residue:201
BDBM249550
NameBDBM249550
Synonyms:US10072016, Compound 148 US10913746, Compound 148 US9434727, 148 | US9777010, Compound 148
TypeSmall organic molecule
Emp. Form.C19H19ClFN5O
Mol. Mass.387.838
SMILESFc1cccc(C2CCN(CC2)C(=O)c2n[nH]c3CN(CCc23)C#N)c1Cl