Reaction Details
TargetC-X-C motif chemokine 10
LigandBDBM249572
Substrate/Competitorn/a
Meas. Tech.Radioligand Binding Assay
Temperature298.15±n/a K
IC50 41±n/a nM
Commentsextracted
Citation Bata, IBartane Bodor, VVasas, ABuzder-Lantos, PFerenczy, GTomoskozi, ZSzeleczky, GSzamosvolgyi, Z Substituted B-amino acid derivatives as CXCR3 receptor antagonists US Patent US9447038 Publication Date 9/20/2016
 
C-X-C motif chemokine 10
Name:C-X-C motif chemokine 10
Type:Enzyme
Mol. Mass.:10892.04
Organism:Homo sapiens (Human)
Description:P02778
Residue:98
BDBM249572
NameBDBM249572
Synonyms:US9447038, 1
TypeSmall organic molecule
Emp. Form.C29H36N2O7
Mol. Mass.524.6053
SMILESCOc1cc(CN(CC(C)C)C(CC(O)=O)c2ccc3OCCc3c2)ccc1OCCN1C(=O)CCC1=O