Reaction Details
TargetC-X-C motif chemokine 10
LigandBDBM249583
Substrate/Competitorn/a
Meas. Tech.Radioligand Binding Assay
Temperature298.15±n/a K
IC50 19±n/a nM
Commentsextracted
Citation Bata, IBartane Bodor, VVasas, ABuzder-Lantos, PFerenczy, GTomoskozi, ZSzeleczky, GSzamosvolgyi, Z Substituted B-amino acid derivatives as CXCR3 receptor antagonists US Patent US9447038 Publication Date 9/20/2016
 
C-X-C motif chemokine 10
Name:C-X-C motif chemokine 10
Type:Enzyme
Mol. Mass.:10892.04
Organism:Homo sapiens (Human)
Description:P02778
Residue:98
BDBM249583
NameBDBM249583
Synonyms:US9447038, 11
TypeSmall organic molecule
Emp. Form.C27H30ClFN2O6
Mol. Mass.532.988
SMILESCOc1cc(CN(CC2CC2)[C@@H](CC(O)=O)c2ccc(Cl)c(F)c2)ccc1OCCN1C(=O)CCC1=O