Reaction Details
TargetC-X-C motif chemokine 10
LigandBDBM249662
Substrate/Competitorn/a
Meas. Tech.Radioligand Binding Assay
Temperature298.15±n/a K
IC50 50±n/a nM
Commentsextracted
Citation Bata, IBartane Bodor, VVasas, ABuzder-Lantos, PFerenczy, GTomoskozi, ZSzeleczky, GSzamosvolgyi, Z Substituted B-amino acid derivatives as CXCR3 receptor antagonists US Patent US9447038 Publication Date 9/20/2016
 
C-X-C motif chemokine 10
Name:C-X-C motif chemokine 10
Type:Enzyme
Mol. Mass.:10892.04
Organism:Homo sapiens (Human)
Description:P02778
Residue:98
BDBM249662
NameBDBM249662
Synonyms:US9447038, 90
TypeSmall organic molecule
Emp. Form.C28H32ClFN2O5
Mol. Mass.531.015
SMILESCCc1cc(CN(CC2CC2)C(CC(O)=O)c2ccc(Cl)c(F)c2)ccc1OCCN1C(=O)CCC1=O