Reaction Details
TargetC-X-C motif chemokine 10
LigandBDBM249703
Substrate/Competitorn/a
Meas. Tech.Radioligand Binding Assay
Temperature298.15±n/a K
IC50 42±n/a nM
Commentsextracted
Citation Bata, IBartane Bodor, VVasas, ABuzder-Lantos, PFerenczy, GTomoskozi, ZSzeleczky, GSzamosvolgyi, Z Substituted B-amino acid derivatives as CXCR3 receptor antagonists US Patent US9447038 Publication Date 9/20/2016
 
C-X-C motif chemokine 10
Name:C-X-C motif chemokine 10
Type:Enzyme
Mol. Mass.:10892.04
Organism:Homo sapiens (Human)
Description:P02778
Residue:98
BDBM249703
NameBDBM249703
Synonyms:US9447038, 131
TypeSmall organic molecule
Emp. Form.C30H35N3O6
Mol. Mass.533.6154
SMILESCc1cc(CN(CC2CC2)C(CC(O)=O)c2ccc3OCCc3c2)ccc1OCCn1c(=O)ccn(C)c1=O